{"text_format":"1","workbook":"xlsx","n_sheets":9,"sheets":["Calcolo","Prodotti","INPS","Planner","Feelgood","DSP ITAPIPDSP1 - ITAPIPDSP3","DSP IUPIP_DSP - ULPIP_DSP","DSP  IUPIP_DSP01- ULPIP_DSP01","DSP IUPIP_DSP05 - ULPIP_DSP05"],"not_rendered":{"charts":0,"images":5,"macros":1,"external_links":0,"defined_names":1,"comments":0,"pivot_tables":0},"unopened":[],"bounds":{"document_bytes":16777216,"sheet_cells":100000,"rows_first":2000,"rows_last":500,"rows_between":2000,"halvings":0,"cell_chars":16384,"cell_head_chars":4096},"cells_cut":0,"cells_raw":0,"read":"whole","date_system":"1900"}

{"sheet":"Calcolo","index":0,"n_rows":52,"n_cols":12,"rows_kept":52,"cut":false,"hidden":false,"merged":[[1,1,1,9],[39,4,39,5],[42,4,42,5],[27,10,27,11],[25,2,30,7],[31,3,31,7],[5,2,5,3],[15,2,15,3],[7,10,17,11],[23,3,23,5],[21,3,21,5],[7,3,7,4],[9,3,9,4],[11,3,11,4],[13,3,13,4],[17,3,17,4],[19,3,19,4],[42,2,42,3],[44,5,44,11],[33,1,33,10],[39,2,39,3],[37,2,37,11]]}
[]
[null,"Calcolo conversione rendita"]
[]
[]
[]
[null,null,"informazioni sul contratto",null,null,null,null,null,null,null,null,{"$f":"TODAY()","v":"2026-02-25"}]
[]
[null,null,"Prodotto",null,null,null,null,null,null,null,"Compilare i campi contrassegnati dalla matita blu selezionando le voci dal menù a tendina. Gli unici campi liberi sono quelli relativi all'anno di nascita e al maturato.\nIn caso di cambio prodotto è necessario rivedere tutti i campi in quanto alcuni potrebbero presentare voci diverse o essere non rilevanti ai fini del calcolo. "]
[]
[null,null,"Anno d'adesione"]
[]
[null,null,"Rateizzazione"]
[]
[null,null,"Opzione"]
[]
[null,null,"informazioni sul contraente"]
[]
[null,null,"Età"]
[]
[null,null,"Sesso",null,null,null,null,null,null,null,"Tasso ",{"$f":"IF(ISBLANK(D8),\"\",INDIRECT(\"'\"&VLOOKUP(D8,Prodotti!B4:C23,2,FALSE)&\"'!E4\"))","v":""}]
{"$rows_left_out":33}
{"sheet":"Prodotti","index":1,"n_rows":10,"n_cols":4,"rows_kept":10,"cut":false,"hidden":true,"merged":[]}
[]
[null,"Lista prodotti",null,"Creato da Vincenzo Auriemma - Agorass srl"]
[]
[null,"Nome","Foglio","Info"]
[null,"Planner","Planner","info presente su EDIWEB (valore riscatto totale per Planner)"]
[null,"Feelgood","Feelgood","info presente su EDIWEB (controvalore quote per Feelgood)"]
[null,"Domani sicuro Plus ITAPIPDSP1 o ITAPIPDSP3","DSP ITAPIPDSP1 - ITAPIPDSP3","info presente su PASS PORTAL (interrogazione contratto => situazione finanziaria => premere \"calcola valore di riscatto netto o lordo delle penali a scelta\")"]
[null,"Domani sicuro Plus IUPIP_DSP o ULPIP_DSP","DSP IUPIP_DSP - ULPIP_DSP","info presente su PASS PORTAL (interrogazione contratto => situazione finanziaria => premere \"calcola valore di riscatto netto o lordo delle penali a scelta\")"]
[null,"Domani sicuro Plus  IUPIP_DSP01 o ULPIP_DSP01","DSP  IUPIP_DSP01- ULPIP_DSP01","info presente su PASS PORTAL (interrogazione contratto => situazione finanziaria => premere \"calcola valore di riscatto netto o lordo delle penali a scelta\")"]
[null,"Domani sicuro Plus  IUPIP_DSP05 o ULPIP_DSP05","DSP IUPIP_DSP05 - ULPIP_DSP05","info presente su PASS PORTAL (interrogazione contratto => situazione finanziaria => premere \"calcola valore di riscatto netto o lordo delle penali a scelta\")"]

{"sheet":"INPS","index":2,"n_rows":4,"n_cols":2,"rows_kept":4,"cut":false,"hidden":true,"merged":[]}
["Anni","Valore INPS"]
[2024,6947.33]
[2025,7002.84]
[2026,7101.12]

{"sheet":"Planner","index":3,"n_rows":230,"n_cols":74,"rows_kept":230,"cut":false,"hidden":true,"merged":[[76,0,76,1],[59,0,59,1],[29,1,29,4],[29,7,29,10],[29,13,29,16]]}
["PLANNER"]
["Dati",null,null,"Calcoli",null,null,null,null,null,"Scelte"]
[null,null,null,null,null,null,null,null,null,"Rendita vitalizia immediata","Rendita certa per 5 anni e poi vitalizia","Rendita certa per 10 anni e poi vitalizia","Rendita certa per 15 anni e poi vitalizia"]
["Adesione",{"$f":"Calcolo!D10","v":0},null,"Tasso",{"$f":"IF(OR(ISBLANK(B4),B4=0),\"\",HLOOKUP(B4,B22:C24,3,FALSE))","v":""},null,null,null,null,"prima del 21/12/2012","dal 21/12/2012 in poi"]
["Sesso",{"$f":"Calcolo!D20","v":0},null,"Tavola demografica",{"$f":"IF(OR(ISBLANK(B4),ISBLANK(B5),B4=0,B5=0),\"\",HLOOKUP(B4,B22:C24,2,FALSE))","v":""},null,null,null,null,"M","F"]
["Anno di nascita",{"$f":"Calcolo!D22","v":0},null,"Fattore correzione",{"$f":"IF(OR(ISBLANK(B4),ISBLANK(B5),B4=0,B5=0),\"\",IF(E5=\"IPS55 distinta\",IF(B5=\"M\",VLOOKUP(B6,A79:D230,2,FALSE),IF(B5=\"F\",VLOOKUP(B6,A79:D230,3,FALSE),\"\")),VLOOKUP(B6,A79:D230,4,FALSE)))","v":""}]
["Età",{"$f":"Calcolo!D18","v":0},null,"Età assicurativa",{"$f":"IF(OR(ISBLANK(B4),ISBLANK(B5),B4=0,B5=0),\"\",B7+E6)","v":""},"Annuale",null,null,null,50,51,52,53,54,55,56,57,58,59,60,61,62,63,64,65,66,67,68,69,70,71,72,73,74,75]
["Rateizzazione",{"$f":"Calcolo!D12","v":0},null,"Coefficiente",{"$f":"IF(OR(ISBLANK(B4),ISBLANK(B5),B4=0,B5=0),\"\",IF(E5=\"IPS55 distinta\",IF(B5=\"M\",VLOOKUP(E7,A31:E57,HLOOKUP(B8,H79:K81,2,FALSE),FALSE),IF(B5=\"F\",VLOOKUP(E7,G31:K57,HLOOKUP(B8,H79:K81,2,FALSE),FALSE),\"\")),VLOOKUP(E7,M31:Q57,HLOOKUP(B8,H79:K81,2,FALSE),FALSE)))","v":""},{"$f":"IF(OR(ISBLANK(B4),ISBLANK(B5),B4=0,B5=0),\"\",IF(E5=\"IPS55 distinta\",IF(B5=\"M\",VLOOKUP(E7,A31:E57,2,FALSE),IF(B5=\"F\",VLOOKUP(E7,G31:K57,2,FALSE),\"\")),VLOOKUP(E7,M31:Q57,2,FALSE)))","v":""},null,null,null,"Annuale","Semestrale","Trimestrale","Mensile"]
["Tipologia",{"$f":"Calcolo!D14","v":0},null,"Rendita",{"$f":"IF(OR(ISBLANK(B4),ISBLANK(B5),B4=0,B5=0),\"\",B10*E8)","v":""},{"$f":"IF(OR(ISBLANK(B4),ISBLANK(B5),B4=0,B5=0),\"\",B10*F8)","v":""}]
["Maturato",{"$f":"Calcolo!D24","v":0},null,"Rendita con fraz.",{"$f":"IF(OR(ISBLANK(B4),ISBLANK(B5),B4=0,B5=0),\"\",E9/HLOOKUP(B8,H79:K81,3,FALSE))","v":""}]
[]
[null,null,null,"Coefficiente",{"$f":"IF(OR(ISBLANK(B9),ISBLANK(B8),B9=0,B8=0,E7=\"\"),\"\",IF(B9=K3,IF(E5=\"IPS55 distinta\",IF(B5=\"M\",VLOOKUP(E7,T31:X57,HLOOKUP(B8,H79:K81,2,FALSE),FALSE),IF(B5=\"F\",VLOOKUP(E7,Z31:AD57,HLOOKUP(B8,H79:K81,2,FALSE),FALSE),\"\")),VLOOKUP(E7,AF31:AJ57,HLOOKUP(B8,H79:K81,2,FALSE),FALSE)),IF(B9=L3,IF(E5=\"IPS55 distinta\",IF(B5=\"M\",VLOOKUP(E7,AM31:AQ57,HLOOKUP(B8,H79:K81,2,FALSE),FALSE),IF(B5=\"F\",VLOOKUP(E7,AS31:AW57,HLOOKUP(B8,H79:K81,2,FALSE),FALSE),\"\")),VLOOKUP(E7,AY31:BC57,HLOOKUP(B8,H79:K81,2,FALSE),FALSE)),IF(B9=M3,IF(E5=\"IPS55 distinta\",IF(B5=\"M\",VLOOKUP(E7,BF31:BJ57,HLOOKUP(B8,H79:K81,2,FALSE),FALSE),IF(B5=\"F\",VLOOKUP(E7,BL31:BP57,HLOOKUP(B8,H79:K81,2,FALSE),FALSE),\"\")),VLOOKUP(E7,BR31:BV57,HLOOKUP(B8,H79:K81,2,FALSE),FALSE))))))","v":""}]
[null,null,null,"Rendita certa",{"$f":"IF(E12=\"\",\"\",B10*E12)","v":""}]
[null,null,null,"Rendita certa con fraz.",{"$f":"IF(E12=\"\",\"\",E13/HLOOKUP(B8,H79:K81,3,FALSE))","v":""}]
[]
[]
[]
[]
["Tabelle"]
[]
{"$rows_left_out":211}
{"sheet":"Feelgood","index":4,"n_rows":230,"n_cols":74,"rows_kept":230,"cut":false,"hidden":true,"merged":[[29,1,29,4],[29,7,29,10],[29,13,29,16],[59,0,59,1],[76,0,76,1]]}
["Feelgood"]
["Dati",null,null,"Calcoli",null,null,null,null,null,"Scelte"]
[null,null,null,null,null,null,null,null,null,"Rendita vitalizia immediata","Rendita certa per 5 anni e poi vitalizia","Rendita certa per 10 anni e poi vitalizia","Rendita certa per 15 anni e poi vitalizia"]
["Adesione",{"$f":"Calcolo!D10","v":0},null,"Tasso",{"$f":"IF(OR(ISBLANK(B4),B4=0),\"\",HLOOKUP(B4,B22:C24,3,FALSE))","v":""},null,null,null,null,"prima del 21/12/2012","dal 21/12/2012 in poi"]
["Sesso",{"$f":"Calcolo!D20","v":0},null,"Tavola demografica",{"$f":"IF(OR(ISBLANK(B4),ISBLANK(B5),B4=0,B5=0),\"\",HLOOKUP(B4,B22:C24,2,FALSE))","v":""},null,null,null,null,"M","F"]
["Anno di nascita",{"$f":"Calcolo!D22","v":0},null,"Fattore correzione",{"$f":"IF(OR(ISBLANK(B4),ISBLANK(B5),B4=0,B5=0),\"\",IF(E5=\"IPS55 distinta\",IF(B5=\"M\",VLOOKUP(B6,A79:D230,2,FALSE),IF(B5=\"F\",VLOOKUP(B6,A79:D230,3,FALSE),\"\")),VLOOKUP(B6,A79:D230,4,FALSE)))","v":""}]
["Età",{"$f":"Calcolo!D18","v":0},null,"Età assicurativa",{"$f":"IF(OR(ISBLANK(B4),ISBLANK(B5),B4=0,B5=0),\"\",B7+E6)","v":""},"Annuale",null,null,null,50,51,52,53,54,55,56,57,58,59,60,61,62,63,64,65,66,67,68,69,70,71,72,73,74,75]
["Rateizzazione",{"$f":"Calcolo!D12","v":0},null,"Coefficiente",{"$f":"IF(OR(ISBLANK(B4),ISBLANK(B5),B4=0,B5=0),\"\",IF(E5=\"IPS55 distinta\",IF(B5=\"M\",VLOOKUP(E7,A31:E57,HLOOKUP(B8,H79:K81,2,FALSE),FALSE),IF(B5=\"F\",VLOOKUP(E7,G31:K57,HLOOKUP(B8,H79:K81,2,FALSE),FALSE),\"\")),VLOOKUP(E7,M31:Q57,HLOOKUP(B8,H79:K81,2,FALSE),FALSE)))","v":""},{"$f":"IF(OR(ISBLANK(B4),ISBLANK(B5),B4=0,B5=0),\"\",IF(E5=\"IPS55 distinta\",IF(B5=\"M\",VLOOKUP(E7,A31:E57,2,FALSE),IF(B5=\"F\",VLOOKUP(E7,G31:K57,2,FALSE),\"\")),VLOOKUP(E7,M31:Q57,2,FALSE)))","v":""},null,null,null,"Annuale","Semestrale","Trimestrale","Mensile"]
["Tipologia",{"$f":"Calcolo!D14","v":0},null,"Rendita",{"$f":"IF(OR(ISBLANK(B4),ISBLANK(B5),B4=0,B5=0),\"\",B10*E8)","v":""},{"$f":"IF(OR(ISBLANK(B4),ISBLANK(B5),B4=0,B5=0),\"\",B10*F8)","v":""}]
["Maturato",{"$f":"Calcolo!D24","v":0},null,"Rendita con fraz.",{"$f":"IF(OR(ISBLANK(B4),ISBLANK(B5),B4=0,B5=0),\"\",E9/HLOOKUP(B8,H79:K81,3,FALSE))","v":""}]
[]
[null,null,null,"Coefficiente",{"$f":"IF(OR(ISBLANK(B9),ISBLANK(B8),B9=0,B8=0,E7=\"\"),\"\",IF(B9=K3,IF(E5=\"IPS55 distinta\",IF(B5=\"M\",VLOOKUP(E7,T31:X57,HLOOKUP(B8,H79:K81,2,FALSE),FALSE),IF(B5=\"F\",VLOOKUP(E7,Z31:AD57,HLOOKUP(B8,H79:K81,2,FALSE),FALSE),\"\")),VLOOKUP(E7,AF31:AJ57,HLOOKUP(B8,H79:K81,2,FALSE),FALSE)),IF(B9=L3,IF(E5=\"IPS55 distinta\",IF(B5=\"M\",VLOOKUP(E7,AM31:AQ57,HLOOKUP(B8,H79:K81,2,FALSE),FALSE),IF(B5=\"F\",VLOOKUP(E7,AS31:AW57,HLOOKUP(B8,H79:K81,2,FALSE),FALSE),\"\")),VLOOKUP(E7,AY31:BC57,HLOOKUP(B8,H79:K81,2,FALSE),FALSE)),IF(B9=M3,IF(E5=\"IPS55 distinta\",IF(B5=\"M\",VLOOKUP(E7,BF31:BJ57,HLOOKUP(B8,H79:K81,2,FALSE),FALSE),IF(B5=\"F\",VLOOKUP(E7,BL31:BP57,HLOOKUP(B8,H79:K81,2,FALSE),FALSE),\"\")),VLOOKUP(E7,BR31:BV57,HLOOKUP(B8,H79:K81,2,FALSE),FALSE))))))","v":""}]
[null,null,null,"Rendita certa",{"$f":"IF(E12=\"\",\"\",B10*E12)","v":""}]
[null,null,null,"Rendita certa con fraz.",{"$f":"IF(E12=\"\",\"\",E13/HLOOKUP(B8,H79:K81,3,FALSE))","v":""}]
[]
[]
[]
[]
["Tabelle"]
[]
{"$rows_left_out":211}
{"sheet":"DSP ITAPIPDSP1 - ITAPIPDSP3","index":5,"n_rows":228,"n_cols":35,"rows_kept":228,"cut":false,"hidden":true,"merged":[[25,1,25,4],[25,7,25,10],[55,0,55,1],[74,0,74,1],[0,0,0,16383]]}
["Domani sicuro Plus ITAPIPDSP1 o ITAPIPDSP3"]
["Dati",null,null,"Calcoli",null,null,null,null,null,"Scelte"]
[null,null,null,null,null,null,null,null,null,"Rendita vitalizia immediata","Rendita certa per 10 anni e poi vitalizia"]
["Adesione",{"$f":"Calcolo!D10","v":0},null,"Tasso",1E-3,null,null,null,null,"Dato non necessario"]
["Sesso",{"$f":"Calcolo!D20","v":0},null,"Tavola demografica","A62",null,null,null,null,"M","F"]
["Anno di nascita",{"$f":"Calcolo!D22","v":0},null,"Fattore correzione",{"$f":"IF(OR(ISBLANK(B6),B6=0),\"\",VLOOKUP(B6,A77:D228,2,FALSE))","v":""}]
["Età",{"$f":"Calcolo!D18","v":0},null,"Età assicurativa",{"$f":"IF(OR(ISBLANK(B8),B8=0,ISBLANK(E6),E6=\"\"),\"\",B7+E6)","v":""},"Annuale",null,null,null,50,51,52,53,54,55,56,57,58,59,60,61,62,63,64,65,66,67,68,69,70,71,72,73,74,75]
["Rateizzazione",{"$f":"Calcolo!D12","v":0},null,"Coefficiente",{"$f":"IF(OR(ISBLANK(B8),B8=0,E7=\"\"),\"\",VLOOKUP(E7,A27:E53,HLOOKUP(B8,H77:K79,2,FALSE),FALSE))","v":""},{"$f":"IF(OR(ISBLANK(B8),B8=0,E7=\"\"),\"\",VLOOKUP(E7,A27:E53,2,FALSE))","v":""},null,null,null,"Annuale","Semestrale","Trimestrale","Mensile"]
["Tipologia",{"$f":"Calcolo!D14","v":0},null,"Rendita",{"$f":"IF(OR(ISBLANK(E8),E8=0,E8=\"\"),\"\",B10*E8)","v":""},{"$f":"IF(OR(ISBLANK(E8),E8=0,E8=\"\"),\"\",B10*F8)","v":""}]
["Maturato",{"$f":"Calcolo!D24","v":0},null,"Rendita con fraz.",{"$f":"IF(OR(ISBLANK(E8),,E8=0,E8=\"\"),\"\",E9/HLOOKUP(B8,H77:K79,3,FALSE))","v":""}]
[]
[null,null,null,"Coefficiente",{"$f":"IF(OR(ISBLANK(B9),ISBLANK(B8),B9=0,B8=0,E7=\"\"),\"\",IF(B9=K3,VLOOKUP(E7,G27:K53,HLOOKUP(B8,H77:K79,2,FALSE),FALSE),\"\"))","v":""}]
[null,null,null,"Rendita certa",{"$f":"IF(E12=\"\",\"\",B10*E12)","v":""}]
[null,null,null,"Rendita certa con fraz.",{"$f":"IF(E12=\"\",\"\",E13/HLOOKUP(B8,H77:K79,3,FALSE))","v":""}]
[]
[]
[]
[]
["Tabelle"]
[]
{"$rows_left_out":209}
{"sheet":"DSP IUPIP_DSP - ULPIP_DSP","index":6,"n_rows":227,"n_cols":38,"rows_kept":227,"cut":false,"hidden":true,"merged":[[0,0,0,16383],[25,1,25,4],[25,7,25,10],[58,0,58,1],[73,0,73,1]]}
["Domani sicuro PlusIUPIP_DSP - ULPIP_DSP"]
["Dati",null,null,"Calcoli",null,null,null,null,null,"Scelte"]
[null,null,null,null,null,null,null,null,null,"Rendita vitalizia immediata","Rendita certa per 10 anni e poi vitalizia"]
["Adesione",{"$f":"Calcolo!D10","v":0},null,"Tasso",2E-3,null,null,null,null,"Dato non necessario"]
["Sesso",{"$f":"Calcolo!D20","v":0},null,"Tavola demografica","IPS55U",null,null,null,null,"M","F"]
["Anno di nascita",{"$f":"Calcolo!D22","v":0},null,"Fattore correzione",{"$f":"IF(OR(ISBLANK(B6),B6=0),\"\",VLOOKUP(B6,A77:B228,2,FALSE))","v":""}]
["Età",{"$f":"Calcolo!D18","v":0},null,"Età assicurativa",{"$f":"IF(OR(ISBLANK(B8),B8=0,ISBLANK(E6),E6=\"\"),\"\",B7+E6)","v":""},"Annuale",null,null,null,50,51,52,53,54,55,56,57,58,59,60,61,62,63,64,65,66,67,68,69,70,71,72,73,74,75,76,77,78]
["Rateizzazione",{"$f":"Calcolo!D12","v":0},null,"Coefficiente",{"$f":"IF(OR(ISBLANK(B8),B8=0,E7=\"\"),\"\",VLOOKUP(E7,A27:E56,HLOOKUP(B8,H76:K78,2,FALSE),FALSE))","v":""},{"$f":"IF(OR(ISBLANK(B8),B8=0,E7=\"\"),\"\",VLOOKUP(E7,A27:E53,2,FALSE))","v":""},null,null,null,"Annuale","Semestrale","Trimestrale","Mensile"]
["Tipologia",{"$f":"Calcolo!D14","v":0},null,"Rendita",{"$f":"IF(OR(ISBLANK(E8),E8=0,E8=\"\"),\"\",B10*E8)","v":""},{"$f":"IF(OR(ISBLANK(E8),E8=0,E8=\"\"),\"\",B10*F8)","v":""}]
["Maturato",{"$f":"Calcolo!D24","v":0},null,"Rendita con fraz.",{"$f":"IF(OR(ISBLANK(E8),E8=0,E8=\"\"),\"\",E9/HLOOKUP(B8,H76:K79,3,FALSE))","v":""}]
[]
[null,null,null,"Coefficiente",{"$f":"IF(OR(ISBLANK(B9),ISBLANK(B8),B9=0,B8=0,E7=\"\"),\"\",IF(B9=K3,VLOOKUP(E7,G27:K53,HLOOKUP(B8,H76:K78,2,FALSE),FALSE),\"\"))","v":""}]
[null,null,null,"Rendita certa",{"$f":"IF(E12=\"\",\"\",B10*E12)","v":""}]
[null,null,null,"Rendita certa con fraz.",{"$f":"IF(E12=\"\",\"\",E13/HLOOKUP(B8,H76:K79,3,FALSE))","v":""}]
[]
[]
[]
[]
["Tabelle"]
[]
{"$rows_left_out":208}
{"sheet":"DSP  IUPIP_DSP01- ULPIP_DSP01","index":7,"n_rows":228,"n_cols":35,"rows_kept":228,"cut":false,"hidden":true,"merged":[[0,0,0,16383],[25,1,25,4],[25,7,25,10],[55,0,55,1],[74,0,74,1]]}
["Domani sicuro Plus IUPIP_DSP01- ULPIP_DSP01"]
["Dati",null,null,"Calcoli",null,null,null,null,null,"Scelte"]
[null,null,null,null,null,null,null,null,null,"Rendita vitalizia immediata","Rendita certa per 10 anni e poi vitalizia"]
["Adesione",{"$f":"Calcolo!D10","v":0},null,"Tasso",1E-3,null,null,null,null,"Dato non necessario"]
["Sesso",{"$f":"Calcolo!D20","v":0},null,"Tavola demografica","A62",null,null,null,null,"M","F"]
["Anno di nascita",{"$f":"Calcolo!D22","v":0},null,"Fattore correzione",{"$f":"IF(OR(ISBLANK(B9),ISBLANK(B5),B6=0,B6=0),\"\",VLOOKUP(B6,A77:D228,2,FALSE))","v":""}]
["Età",{"$f":"Calcolo!D18","v":0},null,"Età assicurativa",{"$f":"IF(OR(ISBLANK(B8),B8=0,ISBLANK(E6),E6=\"\"),\"\",B7+E6)","v":""},"Annuale",null,null,null,50,51,52,53,54,55,56,57,58,59,60,61,62,63,64,65,66,67,68,69,70,71,72,73,74,75]
["Rateizzazione",{"$f":"Calcolo!D12","v":0},null,"Coefficiente",{"$f":"IF(OR(ISBLANK(B8),B8=0,E7=\"\"),\"\",VLOOKUP(E7,A27:E53,HLOOKUP(B8,H77:K79,2,FALSE),FALSE))","v":""},{"$f":"IF(OR(ISBLANK(B8),B8=0,E7=\"\"),\"\",VLOOKUP(E7,A27:E53,2,FALSE))","v":""},null,null,null,"Annuale","Semestrale","Trimestrale","Mensile"]
["Tipologia",{"$f":"Calcolo!D14","v":0},null,"Rendita",{"$f":"IF(OR(ISBLANK(E8),E8=0,E8=\"\"),\"\",B10*E8)","v":""},{"$f":"IF(OR(ISBLANK(E8),E8=0,E8=\"\"),\"\",B10*F8)","v":""}]
["Maturato",{"$f":"Calcolo!D24","v":0},null,"Rendita con fraz.",{"$f":"IF(OR(ISBLANK(E8),E8=0,E8=\"\"),\"\",E9/HLOOKUP(B8,H77:K79,3,FALSE))","v":""}]
[]
[null,null,null,"Coefficiente",{"$f":"IF(OR(ISBLANK(B9),ISBLANK(B8),B9=0,B8=0,E7=\"\"),\"\",IF(B9=K3,VLOOKUP(E7,G27:K53,HLOOKUP(B8,H77:K79,2,FALSE),FALSE),\"\"))","v":""}]
[null,null,null,"Rendita certa",{"$f":"IF(E12=\"\",\"\",B10*E12)","v":""}]
[null,null,null,"Rendita certa con fraz.",{"$f":"IF(E12=\"\",\"\",E13/HLOOKUP(B8,H77:K79,3,FALSE))","v":""}]
[]
[]
[]
[]
["Tabelle"]
[]
{"$rows_left_out":209}
{"sheet":"DSP IUPIP_DSP05 - ULPIP_DSP05","index":8,"n_rows":228,"n_cols":35,"rows_kept":228,"cut":false,"hidden":true,"merged":[[0,0,0,16383],[25,1,25,4],[25,7,25,10],[55,0,55,1],[74,0,74,1]]}
["Domani sicuro Plus IUPIP_DSP05 - ULPIP_DSP05"]
["Dati",null,null,"Calcoli",null,null,null,null,null,"Scelte"]
[null,null,null,null,null,null,null,null,null,"Rendita vitalizia immediata","Rendita certa per 10 anni e poi vitalizia"]
["Adesione",{"$f":"Calcolo!D10","v":0},null,"Tasso",5.0000000000000001E-3,null,null,null,null,"dato non necessario"]
["Sesso",{"$f":"Calcolo!D20","v":0},null,"Tavola demografica","A62",null,null,null,null,"M","F"]
["Anno di nascita",{"$f":"Calcolo!D22","v":0},null,"Fattore correzione",{"$f":"IF(OR(ISBLANK(B6),B6=0),\"\",VLOOKUP(B6,A77:D228,2,FALSE))","v":""}]
["Età",{"$f":"Calcolo!D18","v":0},null,"Età assicurativa",{"$f":"IF(OR(ISBLANK(B8),B8=0,ISBLANK(E6),E6=\"\"),\"\",B7+E6)","v":""},"Annuale",null,null,null,50,51,52,53,54,55,56,57,58,59,60,61,62,63,64,65,66,67,68,69,70,71,72,73,74,75]
["Rateizzazione",{"$f":"Calcolo!D12","v":0},null,"Coefficiente",{"$f":"IF(OR(ISBLANK(B8),B8=0,E7=\"\"),\"\",VLOOKUP(E7,A27:E53,HLOOKUP(B8,H77:K79,2,FALSE),FALSE))","v":""},{"$f":"IF(OR(ISBLANK(B8),B8=0,E7=\"\"),\"\",VLOOKUP(E7,A27:E53,2,FALSE))","v":""},null,null,null,"Annuale","Semestrale","Trimestrale","Mensile"]
["Tipologia",{"$f":"Calcolo!D14","v":0},null,"Rendita",{"$f":"IF(OR(ISBLANK(E8),E8=0,E8=\"\"),\"\",B10*E8)","v":""},{"$f":"IF(OR(ISBLANK(E8),E8=0,E8=\"\"),\"\",B10*F8)","v":""}]
["Maturato",{"$f":"Calcolo!D24","v":0},null,"Rendita con fraz.",{"$f":"IF(OR(ISBLANK(E8),E8=0,E8=\"\"),\"\",E9/HLOOKUP(B8,H77:K79,3,FALSE))","v":""}]
[]
[null,null,null,"Coefficiente",{"$f":"IF(OR(ISBLANK(B9),ISBLANK(B8),B9=0,B8=0,E7=\"\"),\"\",IF(B9=K3,VLOOKUP(E7,G27:K53,HLOOKUP(B8,H77:K79,2,FALSE),FALSE),\"\"))","v":""}]
[null,null,null,"Rendita certa",{"$f":"IF(E12=\"\",\"\",B10*E12)","v":""}]
[null,null,null,"Rendita certa con fraz.",{"$f":"IF(E12=\"\",\"\",E13/HLOOKUP(B8,H77:K79,3,FALSE))","v":""}]
[]
[]
[]
[]
["Tabelle"]
[]
{"$rows_left_out":208}